Target
Krueppel-like factor 5
Ligand
BDBM70195
Substrate
Meas. Tech.
Late stage results from the probe development effort to identify inhibitors of kruppel-like factor 5 (KLF5): luminescence-based cell-based dose response assay for inhibitors of KLF5 (Round 1)
IC50
>39841±n/a nM
Citation
 PubChem, PC Late stage results from the probe development effort to identify inhibitors of kruppel-like factor 5 (KLF5): luminescence-based cell-based dose response assay for inhibitors of KLF5 (Round 1) PubChem Bioassay (2010)[AID] 
Target
Name:
Krueppel-like factor 5
Synonyms:
BTEB2 IKLF KLF5_HUMAN | Kruppel-like factor 5
Type:
Enzyme Catalytic Domain
Mol. Mass.:
50808.71
Organism:
Homo sapiens (Human)
Description:
Q13887
Residue:
457
  
Inhibitor
Name:
BDBM70195
Synonyms:
(6-fluoro-1,3-benzothiazol-2-yl)-(6-mesyl-1,3-benzothiazol-2-yl)amine 6-fluoro-N-(6-methylsulfonyl-1,3-benzothiazol-2-yl)-1,3-benzothiazol-2-amine SR-01000096725-2 | cid_7110050
Type:
Small organic molecule
Emp. Form.:
C15H10FN3O2S3
Mol. Mass.:
379.452
SMILES:
CS(=O)(=O)c1ccc2nc(Nc3nc4ccc(F)cc4s3)sc2c1
: