Target
Krueppel-like factor 5
Ligand
BDBM70203
Substrate
Meas. Tech.
Late stage results from the probe development effort to identify inhibitors of kruppel-like factor 5 (KLF5): luminescence-based cell-based dose response assay for inhibitors of KLF5 (Round 1)
IC50
26285±n/a nM
Citation
 PubChem, PC Late stage results from the probe development effort to identify inhibitors of kruppel-like factor 5 (KLF5): luminescence-based cell-based dose response assay for inhibitors of KLF5 (Round 1) PubChem Bioassay (2010)[AID] 
Target
Name:
Krueppel-like factor 5
Synonyms:
BTEB2 IKLF KLF5_HUMAN | Kruppel-like factor 5
Type:
Enzyme Catalytic Domain
Mol. Mass.:
50808.71
Organism:
Homo sapiens (Human)
Description:
Q13887
Residue:
457
  
Inhibitor
Name:
BDBM70203
Synonyms:
N-[2-(4-chlorophenyl)-5-benzotriazolyl]-2-methylpropanamide N-[2-(4-chlorophenyl)benzotriazol-5-yl]-2-methyl-propionamide SR-03000001320 cid_881898
Type:
Small organic molecule
Emp. Form.:
C16H15ClN4O
Mol. Mass.:
314.77
SMILES:
CC(C)C(=O)Nc1ccc2nn(nc2c1)-c1ccc(Cl)cc1
: