Target
Krueppel-like factor 5
Ligand
BDBM70209
Substrate
Meas. Tech.
Late stage results from the probe development effort to identify inhibitors of kruppel-like factor 5 (KLF5): luminescence-based cell-based dose response assay for inhibitors of KLF5 (Round 1)
IC50
>39841±n/a nM
Citation
 PubChem, PC Late stage results from the probe development effort to identify inhibitors of kruppel-like factor 5 (KLF5): luminescence-based cell-based dose response assay for inhibitors of KLF5 (Round 1) PubChem Bioassay (2010)[AID] 
Target
Name:
Krueppel-like factor 5
Synonyms:
BTEB2 IKLF KLF5_HUMAN | Kruppel-like factor 5
Type:
Enzyme Catalytic Domain
Mol. Mass.:
50808.71
Organism:
Homo sapiens (Human)
Description:
Q13887
Residue:
457
  
Inhibitor
Name:
BDBM70209
Synonyms:
N-(5-acetyl-4-phenyl-1,3-thiazol-2-yl)-1,3-benzothiazole-6-carboxamide N-(5-acetyl-4-phenyl-thiazol-2-yl)-1,3-benzothiazole-6-carboxamide SR-03000001326 cid_5048062
Type:
Small organic molecule
Emp. Form.:
C19H13N3O2S2
Mol. Mass.:
379.455
SMILES:
CC(=O)c1sc(NC(=O)c2ccc3ncsc3c2)nc1-c1ccccc1
: