Target
Protein RecA
Ligand
BDBM70357
Substrate
Meas. Tech.
Fluorescence Cell-Free Homogeneous Counter Screen to Identify Inhibitors of GFP Chromophore Formation
EC50
85740±n/a nM
Citation
 PubChem, PC Fluorescence Cell-Free Homogeneous Counter Screen to Identify Inhibitors of GFP Chromophore Formation PubChem Bioassay (2010)[AID] 
Target
Name:
Protein RecA
Synonyms:
DNA recombination protein RecA recA
Type:
Enzyme Catalytic Domain
Mol. Mass.:
85386.52
Organism:
Mycobacterium tuberculosis H37Rv
Description:
gi_15609874
Residue:
790
  
Inhibitor
Name:
BDBM70357
Synonyms:
2-[[4-cyano-3-[(2-keto-2-methoxy-ethyl)thio]isothiazol-5-yl]thio]acetic acid vinyl ester MLS000085681 cid_3238412 ethenyl 2-[[4-cyano-3-(2-methoxy-2-oxoethyl)sulfanyl-1,2-thiazol-5-yl]sulfanyl]acetate | vinyl ({4-cyano-3-[(2-methoxy-2-oxoethyl)thio]isothiazol-5-yl}thio)acetate
Type:
Small organic molecule
Emp. Form.:
C11H10N2O4S3
Mol. Mass.:
330.403
SMILES:
COC(=O)CSc1nsc(SCC(=O)OC=C)c1C#N
: