Target
Protein RecA
Ligand
BDBM38837
Substrate
Meas. Tech.
Fluorescence Cell-Free Homogeneous Counter Screen to Identify Inhibitors of GFP Chromophore Formation
EC50
5476±n/a nM
Citation
 PubChem, PC Fluorescence Cell-Free Homogeneous Counter Screen to Identify Inhibitors of GFP Chromophore Formation PubChem Bioassay (2010)[AID] 
Target
Name:
Protein RecA
Synonyms:
DNA recombination protein RecA recA
Type:
Enzyme Catalytic Domain
Mol. Mass.:
85386.52
Organism:
Mycobacterium tuberculosis H37Rv
Description:
gi_15609874
Residue:
790
  
Inhibitor
Name:
BDBM38837
Synonyms:
2-(2-phenylethyl)-4H-isoquinoline-1,3-dione MLS000119149 cid_713096
Type:
Small organic molecule
Emp. Form.:
C17H15NO2
Mol. Mass.:
265.3065
SMILES:
O=C1Cc2ccccc2C(=O)N1CCc1ccccc1
: