Target
Protein Rev
Ligand
BDBM67422
Substrate
Meas. Tech.
Counterscreen for inhibitors of gld-1: Fluorescence polarization-based biochemical high throughput dose response assay for inhibitors of the HIV Rev protein-RRE RNA interaction
IC50
>75427±n/a nM
Citation
 PubChem, PC Counterscreen for inhibitors of gld-1: Fluorescence polarization-based biochemical high throughput dose response assay for inhibitors of the HIV Rev protein-RRE RNA interaction PubChem Bioassay (2010)[AID] 
Target
Name:
Protein Rev
Synonyms:
Human immunodeficiency virus type 1 REV rev
Type:
PROTEIN
Mol. Mass.:
13078.11
Organism:
Human immunodeficiency virus 1
Description:
ChEMBL_79479
Residue:
116
  
Inhibitor
Name:
BDBM67422
Synonyms:
1-methyl-4-[2-oxo-2-[4-[3-(trifluoromethyl)phenyl]-1-piperazinyl]ethyl]-5-pyrrolo[3,2-b]pyrrolecarboxylic acid ethyl ester 4-[2-keto-2-[4-[3-(trifluoromethyl)phenyl]piperazino]ethyl]-1-methyl-pyrrolo[3,2-b]pyrrole-5-carboxylic acid ethyl ester SMR000122630 ethyl 1-methyl-4-[2-oxidanylidene-2-[4-[3-(trifluoromethyl)phenyl]piperazin-1-yl]ethyl]pyrrolo[3,2-b]pyrrole-5-carboxylate | ethyl 1-methyl-4-[2-oxo-2-[4-[3-(trifluoromethyl)phenyl]piperazin-1-yl]ethyl]pyrrolo[3,2-b]pyrrole-5-carboxylate
Type:
Small organic molecule
Emp. Form.:
C23H25F3N4O3
Mol. Mass.:
462.4648
SMILES:
CCOC(=O)c1cc2n(C)ccc2n1CC(=O)N1CCN(CC1)c1cccc(c1)C(F)(F)F
: