Target
Protein Rev
Ligand
BDBM67436
Substrate
Meas. Tech.
Counterscreen for inhibitors of gld-1: Fluorescence polarization-based biochemical high throughput dose response assay for inhibitors of the HIV Rev protein-RRE RNA interaction
IC50
18230±n/a nM
Citation
 PubChem, PC Counterscreen for inhibitors of gld-1: Fluorescence polarization-based biochemical high throughput dose response assay for inhibitors of the HIV Rev protein-RRE RNA interaction PubChem Bioassay (2010)[AID] 
Target
Name:
Protein Rev
Synonyms:
Human immunodeficiency virus type 1 REV rev
Type:
PROTEIN
Mol. Mass.:
13078.11
Organism:
Human immunodeficiency virus 1
Description:
ChEMBL_79479
Residue:
116
  
Inhibitor
Name:
BDBM67436
Synonyms:
4-(2-benzo[cd]indolyl)-2,6-dimethylmorpholine 4-benzo[cd]indol-2-yl-2,6-dimethylmorpholine SMR000378045 | cid_4645122
Type:
Small organic molecule
Emp. Form.:
C17H18N2O
Mol. Mass.:
266.3376
SMILES:
CC1CN(CC(C)O1)C1=Nc2cccc3cccc1c23
: