Target
Protein Rev
Ligand
BDBM51287
Substrate
Meas. Tech.
Counterscreen for inhibitors of gld-1: Fluorescence polarization-based biochemical high throughput dose response assay for inhibitors of the HIV Rev protein-RRE RNA interaction
IC50
9529±n/a nM
Citation
 PubChem, PC Counterscreen for inhibitors of gld-1: Fluorescence polarization-based biochemical high throughput dose response assay for inhibitors of the HIV Rev protein-RRE RNA interaction PubChem Bioassay (2010)[AID] 
Target
Name:
Protein Rev
Synonyms:
Human immunodeficiency virus type 1 REV rev
Type:
PROTEIN
Mol. Mass.:
13078.11
Organism:
Human immunodeficiency virus 1
Description:
ChEMBL_79479
Residue:
116
  
Inhibitor
Name:
BDBM51287
Synonyms:
(3-aminophenazin-2-yl)amine SMR000424784 phenazine-2,3-diamine
Type:
Small organic molecule
Emp. Form.:
C12H10N4
Mol. Mass.:
210.2346
SMILES:
Nc1cc2nc3ccccc3nc2cc1N
: