Target
Amyloid-beta A4 precursor protein-binding family A member 1
Ligand
BDBM65757
Substrate
Meas. Tech.
SAR analysis of small molecule inhibitors of Mint-PDZ and N-type Ca2+ channel carboxyl-terminal peptide association using HTRF - Set 2
IC50
>56800±n/a nM
Citation
 PubChem, PC SAR analysis of small molecule inhibitors of Mint-PDZ and N-type Ca2+ channel carboxyl-terminal peptide association using HTRF - Set 2 PubChem Bioassay (2010)[AID] 
Target
Name:
Amyloid-beta A4 precursor protein-binding family A member 1
Synonyms:
APBA1_RAT Mint1 neuronal munc18-1 binding protein
Type:
Enzyme Catalytic Domain
Mol. Mass.:
92603.32
Organism:
Rattus norvegicus
Description:
gi_2625023
Residue:
839
  
Inhibitor
Name:
BDBM65757
Synonyms:
2-(5-methyl-2-furanyl)-4-quinolinecarboxylic acid [2-[(4-methoxyphenyl)methylamino]-2-oxoethyl] ester MLS-0315873.0001 [2-[(4-methoxyphenyl)methylamino]-2-oxoethyl] 2-(5-methylfuran-2-yl)quinoline-4-carboxylate | cid_16233264
Type:
Small organic molecule
Emp. Form.:
C25H22N2O5
Mol. Mass.:
430.4526
SMILES:
COc1ccc(CNC(=O)COC(=O)c2cc(nc3ccccc23)-c2ccc(C)o2)cc1
: