Target
Amyloid-beta A4 precursor protein-binding family A member 1
Ligand
BDBM65770
Substrate
Meas. Tech.
SAR analysis of small molecule inhibitors of Mint-PDZ and N-type Ca2+ channel carboxyl-terminal peptide association using HTRF - Set 2
IC50
10900±n/a nM
Citation
 PubChem, PC SAR analysis of small molecule inhibitors of Mint-PDZ and N-type Ca2+ channel carboxyl-terminal peptide association using HTRF - Set 2 PubChem Bioassay (2010)[AID] 
Target
Name:
Amyloid-beta A4 precursor protein-binding family A member 1
Synonyms:
APBA1_RAT Mint1 neuronal munc18-1 binding protein
Type:
Enzyme Catalytic Domain
Mol. Mass.:
92603.32
Organism:
Rattus norvegicus
Description:
gi_2625023
Residue:
839
  
Inhibitor
Name:
BDBM65770
Synonyms:
2-(2-furanyl)-4-quinolinecarboxylic acid [2-[(2-methylphenyl)methylamino]-2-oxoethyl] ester MLS-0315894.0001 [2-[(2-methylphenyl)methylamino]-2-oxoethyl] 2-(furan-2-yl)quinoline-4-carboxylate | cid_9330761
Type:
Small organic molecule
Emp. Form.:
C24H20N2O4
Mol. Mass.:
400.4266
SMILES:
Cc1ccccc1CNC(=O)COC(=O)c1cc(nc2ccccc12)-c1ccco1
: