Target
Amyloid-beta A4 precursor protein-binding family A member 1
Ligand
BDBM65756
Substrate
Meas. Tech.
SAR analysis of small molecule inhibitors of Mint-PDZ and N-type Ca2+ channel carboxyl-terminal peptide association using HTRF - Set 2
IC50
7730±n/a nM
Citation
 PubChem, PC SAR analysis of small molecule inhibitors of Mint-PDZ and N-type Ca2+ channel carboxyl-terminal peptide association using HTRF - Set 2 PubChem Bioassay (2010)[AID] 
Target
Name:
Amyloid-beta A4 precursor protein-binding family A member 1
Synonyms:
APBA1_RAT Mint1 neuronal munc18-1 binding protein
Type:
Enzyme Catalytic Domain
Mol. Mass.:
92603.32
Organism:
Rattus norvegicus
Description:
gi_2625023
Residue:
839
  
Inhibitor
Name:
BDBM65756
Synonyms:
2-(2-furanyl)-4-quinolinecarboxylic acid [2-[(4-chlorophenyl)methylamino]-2-oxoethyl] ester MLS-0315870.0001 [2-[(4-chlorophenyl)methylamino]-2-oxoethyl] 2-(furan-2-yl)quinoline-4-carboxylate | cid_2553264
Type:
Small organic molecule
Emp. Form.:
C23H17ClN2O4
Mol. Mass.:
420.845
SMILES:
Clc1ccc(CNC(=O)COC(=O)c2cc(nc3ccccc23)-c2ccco2)cc1
: