Target
Amyloid-beta A4 precursor protein-binding family A member 1
Ligand
BDBM56264
Substrate
Meas. Tech.
SAR analysis of small molecule inhibitors of Mint-PDZ and N-type Ca2+ channel carboxyl-terminal peptide association using HTRF - Set 2
IC50
>56800±n/a nM
Citation
 PubChem, PC SAR analysis of small molecule inhibitors of Mint-PDZ and N-type Ca2+ channel carboxyl-terminal peptide association using HTRF - Set 2 PubChem Bioassay (2010)[AID] 
Target
Name:
Amyloid-beta A4 precursor protein-binding family A member 1
Synonyms:
APBA1_RAT Mint1 neuronal munc18-1 binding protein
Type:
Enzyme Catalytic Domain
Mol. Mass.:
92603.32
Organism:
Rattus norvegicus
Description:
gi_2625023
Residue:
839
  
Inhibitor
Name:
BDBM56264
Synonyms:
2-chloro-5-(1,3-diketo-4,7-dimethyl-3a,7a-dihydro-octahydro-1H-4,7-epoxyisoindol-2-yl)benzoic acid methyl ester MLS000107828 cid_2860951 methyl 2-chloro-5-(4,7-dimethyl-1,3-dioxo-3a,7a-dihydro-octahydro-1H-4,7-epoxyisoindol-2-yl)benzoate
Type:
Small organic molecule
Emp. Form.:
C18H16ClNO5
Mol. Mass.:
361.776
SMILES:
COC(=O)c1cc(ccc1Cl)-n1c(O)c2c(c1O)C1(C)OC2(C)C=C1
: