Target
Kappa-type opioid receptor
Ligand
BDBM71574
Substrate
Meas. Tech.
SAR analysis of small molecule antagonists of the kappa opioid receptor via a luminescent beta-arrestin assay - Set 3
IC50
820±n/a nM
Citation
 PubChem, PC SAR analysis of small molecule antagonists of the kappa opioid receptor via a luminescent beta-arrestin assay - Set 3 PubChem Bioassay (2010)[AID] 
Target
Name:
Kappa-type opioid receptor
Synonyms:
K-OR-1 Kappa-opioid receptor (KOR) Kappa-type opioid receptor (KOR) OPIATE Kappa OPRK1 kappa opioid receptor (KOR)
Type:
G Protein-Coupled Receptor (GPCR)
Mol. Mass.:
42648.76
Organism:
Homo sapiens (Human)
Description:
P41145
Residue:
380
  
Inhibitor
Name:
BDBM71574
Synonyms:
KSC-5-271C N-[2-[(4-bromobenzyl)-isopropyl-amino]ethyl]-4-[[(4-ethylphenyl)sulfonylamino]methyl]benzamide N-[2-[(4-bromophenyl)methyl-propan-2-ylamino]ethyl]-4-[[(4-ethylphenyl)sulfonylamino]methyl]benzamide | cid_44608037
Type:
Small organic molecule
Emp. Form.:
C28H34BrN3O3S
Mol. Mass.:
572.557
SMILES:
CCc1ccc(cc1)S(=O)(=O)NCc1ccc(cc1)C(=O)NCCN(Cc1ccc(Br)cc1)C(C)C
: