Target
Kappa-type opioid receptor
Ligand
BDBM71577
Substrate
Meas. Tech.
SAR analysis of small molecule antagonists of the kappa opioid receptor via a luminescent beta-arrestin assay - Set 3
IC50
1420±n/a nM
Citation
 PubChem, PC SAR analysis of small molecule antagonists of the kappa opioid receptor via a luminescent beta-arrestin assay - Set 3 PubChem Bioassay (2010)[AID] 
Target
Name:
Kappa-type opioid receptor
Synonyms:
K-OR-1 Kappa-opioid receptor (KOR) Kappa-type opioid receptor (KOR) OPIATE Kappa OPRK1 kappa opioid receptor (KOR)
Type:
G Protein-Coupled Receptor (GPCR)
Mol. Mass.:
42648.76
Organism:
Homo sapiens (Human)
Description:
P41145
Residue:
380
  
Inhibitor
Name:
BDBM71577
Synonyms:
KSC-11-32-1 N-[2-[benzyl(butan-2-yl)amino]ethyl]-4-[[(4-ethylphenyl)sulfonylamino]methyl]benzamide N-[2-[butan-2-yl-(phenylmethyl)amino]ethyl]-4-[[(4-ethylphenyl)sulfonylamino]methyl]benzamide | cid_44608027
Type:
Small organic molecule
Emp. Form.:
C29H37N3O3S
Mol. Mass.:
507.687
SMILES:
CCC(C)N(CCNC(=O)c1ccc(CNS(=O)(=O)c2ccc(CC)cc2)cc1)Cc1ccccc1
: