Target
Kappa-type opioid receptor
Ligand
BDBM71593
Substrate
Meas. Tech.
SAR analysis of small molecule antagonists of the kappa opioid receptor via a luminescent beta-arrestin assay - Set 3
IC50
16300±n/a nM
Citation
 PubChem, PC SAR analysis of small molecule antagonists of the kappa opioid receptor via a luminescent beta-arrestin assay - Set 3 PubChem Bioassay (2010)[AID] 
Target
Name:
Kappa-type opioid receptor
Synonyms:
K-OR-1 Kappa-opioid receptor (KOR) Kappa-type opioid receptor (KOR) OPIATE Kappa OPRK1 kappa opioid receptor (KOR)
Type:
G Protein-Coupled Receptor (GPCR)
Mol. Mass.:
42648.76
Organism:
Homo sapiens (Human)
Description:
P41145
Residue:
380
  
Inhibitor
Name:
BDBM71593
Synonyms:
KSC-11-44-1 N-[2-[benzyl(ethyl)amino]ethyl]-4-[[(4-methoxyphenyl)sulfonylamino]methyl]benzamide cid_44620901
Type:
Small organic molecule
Emp. Form.:
C26H31N3O4S
Mol. Mass.:
481.607
SMILES:
CCN(CCNC(=O)c1ccc(CNS(=O)(=O)c2ccc(OC)cc2)cc1)Cc1ccccc1
: