Target
NADPH oxidase 1
Ligand
BDBM65839
Substrate
Meas. Tech.
Late stage results from the probe development effort to identify inhibitors of NOX1: HEK/293 IC50 Set 2
IC50
2370±n/a nM
Citation
 PubChem, PC Late stage results from the probe development effort to identify inhibitors of NOX1: HEK/293 IC50 Set 2 PubChem Bioassay (2010)[AID] 
Target
Name:
NADPH oxidase 1
Synonyms:
MOX-1 Mitogenic oxidase 1 NOH-1 NOX-1 NOX1_HUMAN
Type:
PROTEIN
Mol. Mass.:
64890.44
Organism:
Homo sapiens (Human)
Description:
ChEMBL_792877
Residue:
564
  
Inhibitor
Name:
BDBM65839
Synonyms:
1-(4-benzoxyphenyl)-3-[4-(dimethylamino)phenyl]urea SR-01000634030-1 | cid_2815705
Type:
Small organic molecule
Emp. Form.:
C22H23N3O2
Mol. Mass.:
361.4369
SMILES:
CN(C)c1ccc(NC(=O)Nc2ccc(OCc3ccccc3)cc2)cc1
: