Target
NADPH oxidase 1
Ligand
BDBM71623
Substrate
Meas. Tech.
Late stage results from the probe development effort to identify inhibitors of NOX1: HEK/293 IC50 Set 2
IC50
4000±n/a nM
Citation
 PubChem, PC Late stage results from the probe development effort to identify inhibitors of NOX1: HEK/293 IC50 Set 2 PubChem Bioassay (2010)[AID] 
Target
Name:
NADPH oxidase 1
Synonyms:
MOX-1 Mitogenic oxidase 1 NOH-1 NOX-1 NOX1_HUMAN
Type:
PROTEIN
Mol. Mass.:
64890.44
Organism:
Homo sapiens (Human)
Description:
ChEMBL_792877
Residue:
564
  
Inhibitor
Name:
BDBM71623
Synonyms:
3,5-bis(chloranyl)-N-[(E)-[4-(dimethylamino)phenyl]methylideneamino]pyridin-4-amine 3,5-dichloro-N-[(E)-[4-(dimethylamino)phenyl]methylideneamino]pyridin-4-amine [4-[(E)-[(3,5-dichloro-4-pyridyl)hydrazono]methyl]phenyl]-dimethyl-amine | cid_9566216
Type:
Small organic molecule
Emp. Form.:
C14H14Cl2N4
Mol. Mass.:
309.194
SMILES:
CN(C)c1ccc(CN=Nc2c(Cl)cncc2Cl)cc1
: