Target
Heat shock factor protein 1
Ligand
BDBM39084
Substrate
Meas. Tech.
Luminescence Cell-Based Dose Retest to Identify Potentiators of Heat Shock Factor 1 (HSF1)
EC50
44570±n/a nM
Citation
 PubChem, PC Luminescence Cell-Based Dose Retest to Identify Potentiators of Heat Shock Factor 1 (HSF1) PubChem Bioassay (2010)[AID] 
Target
Name:
Heat shock factor protein 1
Synonyms:
HSF1_MOUSE Hsf1 protein
Type:
Enzyme Catalytic Domain
Mol. Mass.:
57208.68
Organism:
Mus musculus
Description:
P38532
Residue:
525
  
Inhibitor
Name:
BDBM39084
Synonyms:
3-(2-furanylmethyl)-9-methyl-N-(2-oxolanylmethyl)-4H-[1,3]thiazino[6,5-b]quinolin-2-imine MLS000032944 [3-(2-furfuryl)-9-methyl-4H-[1,3]thiazino[6,5-b]quinolin-2-ylidene]-(tetrahydrofurfuryl)amine cid_653192
Type:
Small organic molecule
Emp. Form.:
C22H23N3O2S
Mol. Mass.:
393.502
SMILES:
Cc1cccc2cc3CN(Cc4ccco4)\C(Sc3nc12)=N\CC1CCCO1
: