Target
Heat shock factor protein 1
Ligand
BDBM35489
Substrate
Meas. Tech.
Luminescence Cell-Based Dose Retest to Identify Potentiators of Heat Shock Factor 1 (HSF1)
EC50
>260000±n/a nM
Citation
 PubChem, PC Luminescence Cell-Based Dose Retest to Identify Potentiators of Heat Shock Factor 1 (HSF1) PubChem Bioassay (2010)[AID] 
Target
Name:
Heat shock factor protein 1
Synonyms:
HSF1_MOUSE Hsf1 protein
Type:
Enzyme Catalytic Domain
Mol. Mass.:
57208.68
Organism:
Mus musculus
Description:
P38532
Residue:
525
  
Inhibitor
Name:
BDBM35489
Synonyms:
1-Acetyl-3-(3,4-dichloro-5-oxo-2,5-dihydro-furan-2-yl)-urea N-[(3,4-dichloro-5-keto-2H-furan-2-yl)carbamoyl]acetamide N-[[(3,4-dichloro-5-oxo-2H-furan-2-yl)amino]-oxomethyl]acetamide SMR000001295 | cid_654815
Type:
Small organic molecule
Emp. Form.:
C7H6Cl2N2O4
Mol. Mass.:
253.04
SMILES:
CC(=O)NC(=O)NC1OC(=O)C(Cl)=C1Cl
: