Target
Heat shock factor protein 1
Ligand
BDBM72017
Substrate
Meas. Tech.
Luminescence Cell-Based Dose Retest to Identify Potentiators of Heat Shock Factor 1 (HSF1)
EC50
>260000±n/a nM
Citation
 PubChem, PC Luminescence Cell-Based Dose Retest to Identify Potentiators of Heat Shock Factor 1 (HSF1) PubChem Bioassay (2010)[AID] 
Target
Name:
Heat shock factor protein 1
Synonyms:
HSF1_MOUSE Hsf1 protein
Type:
Enzyme Catalytic Domain
Mol. Mass.:
57208.68
Organism:
Mus musculus
Description:
P38532
Residue:
525
  
Inhibitor
Name:
BDBM72017
Synonyms:
3-(1-adamantyl)-5,6-bis(azanyl)-8-[ethyl(2-methylprop-2-enyl)amino]-2-oxidanylidene-1H-pyrrolo[2,3-c][2,7]naphthyridine-9-carbonitrile 3-(1-adamantyl)-5,6-diamino-8-[ethyl(2-methylprop-2-enyl)amino]-2-oxo-1H-pyrrolo[2,3-c][2,7]naphthyridine-9-carbonitrile SMR000155353 | cid_3347676
Type:
Small organic molecule
Emp. Form.:
C27H33N7O
Mol. Mass.:
471.5972
SMILES:
[H]C12CC3([H])CC([H])(C1)CC(C2)(C3)N1C(=O)Cc2c1nc(N)c1c(N)nc(N(CC)CC(C)=C)c(C#N)c21
: