Target
Protein RecA
Ligand
BDBM31689
Substrate
Meas. Tech.
Fluorescence Cell-Free Homogeneous Dose Retest to Identify Inhibitors of RecA-Intein Splicing Activity
EC50
1360±n/a nM
Citation
 PubChem, PC Fluorescence Cell-Free Homogeneous Dose Retest to Identify Inhibitors of RecA-Intein Splicing Activity PubChem Bioassay (2010)[AID] 
Target
Name:
Protein RecA
Synonyms:
DNA recombination protein RecA recA
Type:
Enzyme Catalytic Domain
Mol. Mass.:
85386.52
Organism:
Mycobacterium tuberculosis H37Rv
Description:
gi_15609874
Residue:
790
  
Inhibitor
Name:
BDBM31689
Synonyms:
1'-acetyl-6-amino-3-methyl-5-spiro[2H-pyrano[2,3-c]pyrazole-4,4'-piperidine]carbonitrile 1'-acetyl-6-amino-3-methylspiro[2H-pyrano[2,3-c]pyrazole-4,4'-piperidine]-5-carbonitrile MLS000034955 cid_645612
Type:
Small organic molecule
Emp. Form.:
C14H17N5O2
Mol. Mass.:
287.3171
SMILES:
CC(=O)N1CCC2(CC1)C(C#N)C(=N)Oc1n[nH]c(C)c21
: