Target
Protein RecA
Ligand
BDBM34210
Substrate
Meas. Tech.
Fluorescence Cell-Free Homogeneous Dose Retest to Identify Inhibitors of RecA-Intein Splicing Activity
EC50
1930±n/a nM
Citation
 PubChem, PC Fluorescence Cell-Free Homogeneous Dose Retest to Identify Inhibitors of RecA-Intein Splicing Activity PubChem Bioassay (2010)[AID] 
Target
Name:
Protein RecA
Synonyms:
DNA recombination protein RecA recA
Type:
Enzyme Catalytic Domain
Mol. Mass.:
85386.52
Organism:
Mycobacterium tuberculosis H37Rv
Description:
gi_15609874
Residue:
790
  
Inhibitor
Name:
BDBM34210
Synonyms:
3-(3-Chloro-4-morpholin-4-yl-2,5-dioxo-2,5-dihydro-pyrrol-1-yl)-benzoic acid methyl ester 3-[3-chloro-4-(4-morpholinyl)-2,5-dioxo-1-pyrrolyl]benzoic acid methyl ester SMR000014938 methyl 3-(3-chloro-4-morpholin-4-yl-2,5-dioxopyrrol-1-yl)benzoate | methyl 3-[3-chloranyl-4-morpholin-4-yl-2,5-bis(oxidanylidene)pyrrol-1-yl]benzoate
Type:
Small organic molecule
Emp. Form.:
C16H15ClN2O5
Mol. Mass.:
350.754
SMILES:
COC(=O)c1cccc(c1)N1C(=O)C(Cl)=C(N2CCOCC2)C1=O
: