Target
Protein RecA
Ligand
BDBM38821
Substrate
Meas. Tech.
Fluorescence Cell-Free Homogeneous Dose Retest to Identify Inhibitors of RecA-Intein Splicing Activity
EC50
689±n/a nM
Citation
 PubChem, PC Fluorescence Cell-Free Homogeneous Dose Retest to Identify Inhibitors of RecA-Intein Splicing Activity PubChem Bioassay (2010)[AID] 
Target
Name:
Protein RecA
Synonyms:
DNA recombination protein RecA recA
Type:
Enzyme Catalytic Domain
Mol. Mass.:
85386.52
Organism:
Mycobacterium tuberculosis H37Rv
Description:
gi_15609874
Residue:
790
  
Inhibitor
Name:
BDBM38821
Synonyms:
6-Amino-4-(3-ethoxy-4-hydroxy-phenyl)-3-phenyl-1,4-dihydro-pyrano[2,3-c]pyrazole 6-amino-4-(3-ethoxy-4-hydroxyphenyl)-3-phenyl-2,4-dihydropyrano[2,3-c]pyrazole-5-carbonitrile MLS000084991 cid_3139811
Type:
Small organic molecule
Emp. Form.:
C21H18N4O3
Mol. Mass.:
374.3926
SMILES:
CCOc1cc(ccc1O)C1C(C#N)C(=N)Oc2[nH]nc(c12)-c1ccccc1
: