Target
Eukaryotic translation initiation factor 4H
Ligand
BDBM73150
Substrate
Meas. Tech.
SAR analysis for the identification of translation initiation inhibitors (eIF4H)
IC50
>100000±n/a nM
Citation
 PubChem, PC SAR analysis for the identification of translation initiation inhibitors (eIF4H) PubChem Bioassay (2010)[AID] 
Target
Name:
Eukaryotic translation initiation factor 4H
Synonyms:
EIF4H KIAA0038 WSCR1
Type:
Enzyme Catalytic Domain
Mol. Mass.:
27385.24
Organism:
Homo sapiens (Human)
Description:
Q15056
Residue:
248
  
Inhibitor
Name:
BDBM73150
Synonyms:
4-(2-ketopyrrolidino)benzoic acid [2-keto-2-(2-methoxy-4-nitro-anilino)ethyl] ester MLS-0435517.0001 [2-[(2-methoxy-4-nitro-phenyl)amino]-2-oxidanylidene-ethyl] 4-(2-oxidanylidenepyrrolidin-1-yl)benzoate | cid_3895856
Type:
Small organic molecule
Emp. Form.:
C20H19N3O7
Mol. Mass.:
413.3808
SMILES:
COc1cc(ccc1NC(=O)COC(=O)c1ccc(cc1)N1CCCC1=O)[N+]([O-])=O
: