Target
Eukaryotic translation initiation factor 4H
Ligand
BDBM73154
Substrate
Meas. Tech.
SAR analysis for the identification of translation initiation inhibitors (eIF4H)
IC50
>100000±n/a nM
Citation
 PubChem, PC SAR analysis for the identification of translation initiation inhibitors (eIF4H) PubChem Bioassay (2010)[AID] 
Target
Name:
Eukaryotic translation initiation factor 4H
Synonyms:
EIF4H KIAA0038 WSCR1
Type:
Enzyme Catalytic Domain
Mol. Mass.:
27385.24
Organism:
Homo sapiens (Human)
Description:
Q15056
Residue:
248
  
Inhibitor
Name:
BDBM73154
Synonyms:
4-(carbamoylamino)benzoic acid [2-(5-chloro-2-methoxyanilino)-2-oxoethyl] ester MLS-0435521.0001 [2-[(5-chloranyl-2-methoxy-phenyl)amino]-2-oxidanylidene-ethyl] 4-(aminocarbonylamino)benzoate | cid_2116587
Type:
Small organic molecule
Emp. Form.:
C17H16ClN3O5
Mol. Mass.:
377.779
SMILES:
COc1ccc(Cl)cc1NC(=O)COC(=O)c1ccc(NC(N)=O)cc1
: