Target
Eukaryotic translation initiation factor 4H
Ligand
BDBM2282
Substrate
Meas. Tech.
SAR analysis for the identification of translation initiation inhibitors (eIF4H)
IC50
>100000±n/a nM
Citation
 PubChem, PC SAR analysis for the identification of translation initiation inhibitors (eIF4H) PubChem Bioassay (2010)[AID] 
Target
Name:
Eukaryotic translation initiation factor 4H
Synonyms:
EIF4H KIAA0038 WSCR1
Type:
Enzyme Catalytic Domain
Mol. Mass.:
27385.24
Organism:
Homo sapiens (Human)
Description:
Q15056
Residue:
248
  
Inhibitor
Name:
BDBM2282
Synonyms:
5Cl3PhS-2IndolCONH2 inhibitor 9a methyl 3-(phenylsulfanyl)-1H-indole-2-carboxylate
Type:
Small organic molecule
Emp. Form.:
C16H13NO2S
Mol. Mass.:
283.345
SMILES:
COC(=O)c1[nH]c2ccccc2c1Sc1ccccc1
: