Target
Eukaryotic translation initiation factor 4H
Ligand
BDBM61295
Substrate
Meas. Tech.
SAR analysis for the identification of translation initiation inhibitors (eIF4H)
IC50
>100000±n/a nM
Citation
 PubChem, PC SAR analysis for the identification of translation initiation inhibitors (eIF4H) PubChem Bioassay (2010)[AID] 
Target
Name:
Eukaryotic translation initiation factor 4H
Synonyms:
EIF4H KIAA0038 WSCR1
Type:
Enzyme Catalytic Domain
Mol. Mass.:
27385.24
Organism:
Homo sapiens (Human)
Description:
Q15056
Residue:
248
  
Inhibitor
Name:
BDBM61295
Synonyms:
2-[6-(furan-2-yl)pyridazin-3-yl]sulfanyl-N-[(3-methoxyphenyl)methyl]acetamide 2-[[6-(2-furanyl)-3-pyridazinyl]thio]-N-[(3-methoxyphenyl)methyl]acetamide MLS000678489 cid_7222420
Type:
Small organic molecule
Emp. Form.:
C18H17N3O3S
Mol. Mass.:
355.411
SMILES:
COc1cccc(CNC(=O)CSc2ccc(nn2)-c2ccco2)c1
: