Target
Polyadenylate-binding protein 1
Ligand
BDBM73152
Substrate
Meas. Tech.
SAR analysis for the identification of translation initiation inhibitors (PABP)
IC50
>100000±n/a nM
Citation
 PubChem, PC SAR analysis for the identification of translation initiation inhibitors (PABP) PubChem Bioassay (2010)[AID] 
Target
Name:
Polyadenylate-binding protein 1
Synonyms:
PAB1 PABP1 PABPC1 poly(A) binding protein, cytoplasmic 1 | polyadenylate-binding protein 1
Type:
Enzyme Catalytic Domain
Mol. Mass.:
70694.26
Organism:
Homo sapiens (Human)
Description:
gi_46367787
Residue:
636
  
Inhibitor
Name:
BDBM73152
Synonyms:
4-(methoxymethyl)benzoic acid [2-(2-methoxy-4-nitroanilino)-2-oxoethyl] ester MLS-0435519.0001 [2-[(2-methoxy-4-nitro-phenyl)amino]-2-oxidanylidene-ethyl] 4-(methoxymethyl)benzoate | cid_7488993
Type:
Small organic molecule
Emp. Form.:
C18H18N2O7
Mol. Mass.:
374.3447
SMILES:
COCc1ccc(cc1)C(=O)OCC(=O)Nc1ccc(cc1OC)[N+]([O-])=O
: