Target
Polyadenylate-binding protein 1
Ligand
BDBM61384
Substrate
Meas. Tech.
SAR analysis for the identification of translation initiation inhibitors (PABP)
IC50
15700±n/a nM
Citation
 PubChem, PC SAR analysis for the identification of translation initiation inhibitors (PABP) PubChem Bioassay (2010)[AID] 
Target
Name:
Polyadenylate-binding protein 1
Synonyms:
PAB1 PABP1 PABPC1 poly(A) binding protein, cytoplasmic 1 | polyadenylate-binding protein 1
Type:
Enzyme Catalytic Domain
Mol. Mass.:
70694.26
Organism:
Homo sapiens (Human)
Description:
gi_46367787
Residue:
636
  
Inhibitor
Name:
BDBM61384
Synonyms:
(4-propan-2-ylphenyl) 3-(4-methylpiperazin-1-yl)sulfonylbenzoate 3-[(4-methyl-1-piperazinyl)sulfonyl]benzoic acid (4-propan-2-ylphenyl) ester SMR000712585 | cid_24817938
Type:
Small organic molecule
Emp. Form.:
C21H26N2O4S
Mol. Mass.:
402.507
SMILES:
CC(C)c1ccc(OC(=O)c2cccc(c2)S(=O)(=O)N2CCN(C)CC2)cc1
: