Target
Polyadenylate-binding protein 1
Ligand
BDBM73165
Substrate
Meas. Tech.
SAR analysis for the identification of translation initiation inhibitors (PABP)
IC50
>100000±n/a nM
Citation
 PubChem, PC SAR analysis for the identification of translation initiation inhibitors (PABP) PubChem Bioassay (2010)[AID] 
Target
Name:
Polyadenylate-binding protein 1
Synonyms:
PAB1 PABP1 PABPC1 poly(A) binding protein, cytoplasmic 1 | polyadenylate-binding protein 1
Type:
Enzyme Catalytic Domain
Mol. Mass.:
70694.26
Organism:
Homo sapiens (Human)
Description:
gi_46367787
Residue:
636
  
Inhibitor
Name:
BDBM73165
Synonyms:
MLS-0435550.0001 N-(2-chlorophenyl)-1-(thiophene-2-carbonyl)piperidine-4-carboxamide N-(2-chlorophenyl)-1-thiophen-2-ylcarbonyl-piperidine-4-carboxamide | cid_778132
Type:
Small organic molecule
Emp. Form.:
C17H17ClN2O2S
Mol. Mass.:
348.847
SMILES:
Clc1ccccc1NC(=O)C1CCN(CC1)C(=O)c1cccs1
: