Target
Polyadenylate-binding protein 1
Ligand
BDBM61236
Substrate
Meas. Tech.
SAR analysis for the identification of translation initiation inhibitors (PABP)
IC50
52600±n/a nM
Citation
 PubChem, PC SAR analysis for the identification of translation initiation inhibitors (PABP) PubChem Bioassay (2010)[AID] 
Target
Name:
Polyadenylate-binding protein 1
Synonyms:
PAB1 PABP1 PABPC1 poly(A) binding protein, cytoplasmic 1 | polyadenylate-binding protein 1
Type:
Enzyme Catalytic Domain
Mol. Mass.:
70694.26
Organism:
Homo sapiens (Human)
Description:
gi_46367787
Residue:
636
  
Inhibitor
Name:
BDBM61236
Synonyms:
2-{4-[(2-Hydroxy-benzoyl)-hydrazonomethyl]-2-methoxy-phenoxy}-N-phenyl-acetamide N-[[3-methoxy-4-(2-oxidanylidene-2-phenylazanyl-ethoxy)phenyl]methylideneamino]-2-oxidanyl-benzamide N-[[4-(2-anilino-2-oxoethoxy)-3-methoxyphenyl]methylideneamino]-2-hydroxybenzamide cid_1105530
Type:
Small organic molecule
Emp. Form.:
C23H21N3O5
Mol. Mass.:
419.4299
SMILES:
COc1cc(C=NNC(=O)c2ccccc2O)ccc1OCC(=O)Nc1ccccc1
: