Target
Polyadenylate-binding protein 1
Ligand
BDBM73170
Substrate
Meas. Tech.
SAR analysis for the identification of translation initiation inhibitors (PABP)
IC50
>100000±n/a nM
Citation
 PubChem, PC SAR analysis for the identification of translation initiation inhibitors (PABP) PubChem Bioassay (2010)[AID] 
Target
Name:
Polyadenylate-binding protein 1
Synonyms:
PAB1 PABP1 PABPC1 poly(A) binding protein, cytoplasmic 1 | polyadenylate-binding protein 1
Type:
Enzyme Catalytic Domain
Mol. Mass.:
70694.26
Organism:
Homo sapiens (Human)
Description:
gi_46367787
Residue:
636
  
Inhibitor
Name:
BDBM73170
Synonyms:
2-[(4-methoxyanilino)-oxomethyl]-1-pyrrolidinecarboxylic acid phenyl ester MLS-0275470.0001 phenyl 2-[(4-methoxyphenyl)carbamoyl]pyrrolidine-1-carboxylate
Type:
Small organic molecule
Emp. Form.:
C19H20N2O4
Mol. Mass.:
340.3731
SMILES:
COc1ccc(NC(=O)C2CCCN2C(=O)Oc2ccccc2)cc1
: