Target
Polyadenylate-binding protein 1
Ligand
BDBM61394
Substrate
Meas. Tech.
SAR analysis for the identification of translation initiation inhibitors (PABP)
IC50
>100000±n/a nM
Citation
 PubChem, PC SAR analysis for the identification of translation initiation inhibitors (PABP) PubChem Bioassay (2010)[AID] 
Target
Name:
Polyadenylate-binding protein 1
Synonyms:
PAB1 PABP1 PABPC1 poly(A) binding protein, cytoplasmic 1 | polyadenylate-binding protein 1
Type:
Enzyme Catalytic Domain
Mol. Mass.:
70694.26
Organism:
Homo sapiens (Human)
Description:
gi_46367787
Residue:
636
  
Inhibitor
Name:
BDBM61394
Synonyms:
MLS001235564 N-(3-acetamidophenyl)-2-[6-(furan-2-yl)pyridazin-3-yl]sulfanylacetamide N-(3-acetamidophenyl)-2-[[6-(2-furyl)pyridazin-3-yl]thio]acetamide cid_7207150
Type:
Small organic molecule
Emp. Form.:
C18H16N4O3S
Mol. Mass.:
368.41
SMILES:
CC(=O)Nc1cccc(NC(=O)CSc2ccc(nn2)-c2ccco2)c1
: