Target
Polyadenylate-binding protein 1
Ligand
BDBM73203
Substrate
Meas. Tech.
SAR analysis for the identification of translation initiation inhibitors (PABP)
IC50
>100000±n/a nM
Citation
 PubChem, PC SAR analysis for the identification of translation initiation inhibitors (PABP) PubChem Bioassay (2010)[AID] 
Target
Name:
Polyadenylate-binding protein 1
Synonyms:
PAB1 PABP1 PABPC1 poly(A) binding protein, cytoplasmic 1 | polyadenylate-binding protein 1
Type:
Enzyme Catalytic Domain
Mol. Mass.:
70694.26
Organism:
Homo sapiens (Human)
Description:
gi_46367787
Residue:
636
  
Inhibitor
Name:
BDBM73203
Synonyms:
2-[1-methyl-3-(phenylthio)-2-indolyl]acetic acid ethyl ester MLS-0205060.0001 ethyl 2-(1-methyl-3-phenylsulfanyl-indol-2-yl)ethanoate | ethyl 2-(1-methyl-3-phenylsulfanylindol-2-yl)acetate
Type:
Small organic molecule
Emp. Form.:
C19H19NO2S
Mol. Mass.:
325.425
SMILES:
CCOC(=O)Cc1c(Sc2ccccc2)c2ccccc2n1C
: