Target
Protein LANA1
Ligand
BDBM32035
Substrate
Meas. Tech.
Fluorescence Polarization Cell-Free Homogeneous Dose Retest to Confirm Inhibitors of the LANA Histone H2A/H2B Interaction
EC50
2248±n/a nM
Citation
 PubChem, PC Fluorescence Polarization Cell-Free Homogeneous Dose Retest to Confirm Inhibitors of the LANA Histone H2A/H2B Interaction PubChem Bioassay (2010)[AID] 
Target
Name:
Protein LANA1
Synonyms:
LANA LANA1_HHV8P
Type:
Enzyme Catalytic Domain
Mol. Mass.:
131093.36
Organism:
Human herpesvirus 8
Description:
Q9QR71
Residue:
1129
  
Inhibitor
Name:
BDBM32035
Synonyms:
MLS000080234 cid_659413
Type:
Small organic molecule
Emp. Form.:
C19H12N2O3
Mol. Mass.:
316.3102
SMILES:
O=C1c2ccccc2-c2onc3ccc(NCc4ccco4)c1c23
: