Target
Protein LANA1
Ligand
BDBM46835
Substrate
Meas. Tech.
Fluorescence Polarization Cell-Free Homogeneous Dose Retest to Confirm Inhibitors of the LANA Histone H2A/H2B Interaction
EC50
>75000±n/a nM
Citation
 PubChem, PC Fluorescence Polarization Cell-Free Homogeneous Dose Retest to Confirm Inhibitors of the LANA Histone H2A/H2B Interaction PubChem Bioassay (2010)[AID] 
Target
Name:
Protein LANA1
Synonyms:
LANA LANA1_HHV8P
Type:
Enzyme Catalytic Domain
Mol. Mass.:
131093.36
Organism:
Human herpesvirus 8
Description:
Q9QR71
Residue:
1129
  
Inhibitor
Name:
BDBM46835
Synonyms:
MLS000086935 N-cycloheptylquinoline-8-sulfonamide cid_3244108
Type:
Small organic molecule
Emp. Form.:
C16H20N2O2S
Mol. Mass.:
304.407
SMILES:
O=S(=O)(NC1CCCCCC1)c1cccc2cccnc12
: