Target
Protein LANA1
Ligand
BDBM73330
Substrate
Meas. Tech.
Fluorescence Polarization Cell-Free Homogeneous Dose Retest to Confirm Inhibitors of the LANA Histone H2A/H2B Interaction
EC50
>75000±n/a nM
Citation
 PubChem, PC Fluorescence Polarization Cell-Free Homogeneous Dose Retest to Confirm Inhibitors of the LANA Histone H2A/H2B Interaction PubChem Bioassay (2010)[AID] 
Target
Name:
Protein LANA1
Synonyms:
LANA LANA1_HHV8P
Type:
Enzyme Catalytic Domain
Mol. Mass.:
131093.36
Organism:
Human herpesvirus 8
Description:
Q9QR71
Residue:
1129
  
Inhibitor
Name:
BDBM73330
Synonyms:
2-(N-besyl-2,5-dimethoxy-anilino)-N-(3-methoxypropyl)acetamide 2-[N-(benzenesulfonyl)-2,5-dimethoxyanilino]-N-(3-methoxypropyl)acetamide N~2~-(2,5-dimethoxyphenyl)-N~1~-(3-methoxypropyl)-N~2~-(phenylsulfonyl)glycinamide cid_2273760
Type:
Small organic molecule
Emp. Form.:
C20H26N2O6S
Mol. Mass.:
422.495
SMILES:
COCCCNC(=O)CN(c1cc(OC)ccc1OC)S(=O)(=O)c1ccccc1
: