Target
Protein LANA1
Ligand
BDBM73377
Substrate
Meas. Tech.
Fluorescence Polarization Cell-Free Homogeneous Dose Retest to Confirm Inhibitors of the LANA Histone H2A/H2B Interaction
EC50
>75000±n/a nM
Citation
 PubChem, PC Fluorescence Polarization Cell-Free Homogeneous Dose Retest to Confirm Inhibitors of the LANA Histone H2A/H2B Interaction PubChem Bioassay (2010)[AID] 
Target
Name:
Protein LANA1
Synonyms:
LANA LANA1_HHV8P
Type:
Enzyme Catalytic Domain
Mol. Mass.:
131093.36
Organism:
Human herpesvirus 8
Description:
Q9QR71
Residue:
1129
  
Inhibitor
Name:
BDBM73377
Synonyms:
4-(1,3-dioxo-2-isoindolyl)-N-(2-furanylmethyl)-1-cyclohexanecarboxamide 4-[1,3-bis(oxidanylidene)isoindol-2-yl]-N-(furan-2-ylmethyl)cyclohexane-1-carboxamide N-(2-furfuryl)-4-phthalimido-cyclohexanecarboxamide cid_1164668
Type:
Small organic molecule
Emp. Form.:
C20H20N2O4
Mol. Mass.:
352.3838
SMILES:
O=C(NCc1ccco1)C1CCC(CC1)N1C(=O)c2ccccc2C1=O
: