Target
Protein LANA1
Ligand
BDBM73381
Substrate
Meas. Tech.
Fluorescence Polarization Cell-Free Homogeneous Dose Retest to Confirm Inhibitors of the LANA Histone H2A/H2B Interaction
EC50
>75000±n/a nM
Citation
 PubChem, PC Fluorescence Polarization Cell-Free Homogeneous Dose Retest to Confirm Inhibitors of the LANA Histone H2A/H2B Interaction PubChem Bioassay (2010)[AID] 
Target
Name:
Protein LANA1
Synonyms:
LANA LANA1_HHV8P
Type:
Enzyme Catalytic Domain
Mol. Mass.:
131093.36
Organism:
Human herpesvirus 8
Description:
Q9QR71
Residue:
1129
  
Inhibitor
Name:
BDBM73381
Synonyms:
Acetic acid 4-([1,2,4]triazol-4-ylcarbamoyl)-phenyl ester SMR000118996 [4-(1,2,4-triazol-4-ylcarbamoyl)phenyl] ethanoate acetic acid [4-[oxo-(1,2,4-triazol-4-ylamino)methyl]phenyl] ester | cid_743761
Type:
Small organic molecule
Emp. Form.:
C11H10N4O3
Mol. Mass.:
246.2221
SMILES:
CC(=O)Oc1ccc(cc1)C(=O)Nn1cnnc1
: