Target
Protein LANA1
Ligand
BDBM74284
Substrate
Meas. Tech.
Fluorescence Polarization Cell-Free Homogeneous Dose Retest to Confirm Inhibitors of the LANA Histone H2A/H2B Interaction
EC50
>75000±n/a nM
Citation
 PubChem, PC Fluorescence Polarization Cell-Free Homogeneous Dose Retest to Confirm Inhibitors of the LANA Histone H2A/H2B Interaction PubChem Bioassay (2010)[AID] 
Target
Name:
Protein LANA1
Synonyms:
LANA LANA1_HHV8P
Type:
Enzyme Catalytic Domain
Mol. Mass.:
131093.36
Organism:
Human herpesvirus 8
Description:
Q9QR71
Residue:
1129
  
Inhibitor
Name:
BDBM74284
Synonyms:
MLS002182867 N'-(3-cyclopentylpropanoyl)-4-fluoranyl-benzohydrazide N'-(3-cyclopentylpropanoyl)-4-fluorobenzohydrazide cid_918504
Type:
Small organic molecule
Emp. Form.:
C15H19FN2O2
Mol. Mass.:
278.322
SMILES:
Fc1ccc(cc1)C(=O)NNC(=O)CCC1CCCC1
: