Target
Protein LANA1
Ligand
BDBM74285
Substrate
Meas. Tech.
Fluorescence Polarization Cell-Free Homogeneous Dose Retest to Confirm Inhibitors of the LANA Histone H2A/H2B Interaction
EC50
6946±n/a nM
Citation
 PubChem, PC Fluorescence Polarization Cell-Free Homogeneous Dose Retest to Confirm Inhibitors of the LANA Histone H2A/H2B Interaction PubChem Bioassay (2010)[AID] 
Target
Name:
Protein LANA1
Synonyms:
LANA LANA1_HHV8P
Type:
Enzyme Catalytic Domain
Mol. Mass.:
131093.36
Organism:
Human herpesvirus 8
Description:
Q9QR71
Residue:
1129
  
Inhibitor
Name:
BDBM74285
Synonyms:
MLS002179701 N-[2-(3-methoxyanilino)-2-oxoethyl]-N-methyl-2-(5-methylfuran-2-yl)quinoline-4-carboxamide N-[2-keto-2-(m-anisidino)ethyl]-N-methyl-2-(5-methyl-2-furyl)cinchoninamide cid_25162034
Type:
Small organic molecule
Emp. Form.:
C25H23N3O4
Mol. Mass.:
429.4678
SMILES:
COc1cccc(NC(=O)CN(C)C(=O)c2cc(nc3ccccc23)-c2ccc(C)o2)c1
: