Target
Protein LANA1
Ligand
BDBM74324
Substrate
Meas. Tech.
Fluorescence Polarization Cell-Free Homogeneous Dose Retest to Confirm Inhibitors of the LANA Histone H2A/H2B Interaction
EC50
>75000±n/a nM
Citation
 PubChem, PC Fluorescence Polarization Cell-Free Homogeneous Dose Retest to Confirm Inhibitors of the LANA Histone H2A/H2B Interaction PubChem Bioassay (2010)[AID] 
Target
Name:
Protein LANA1
Synonyms:
LANA LANA1_HHV8P
Type:
Enzyme Catalytic Domain
Mol. Mass.:
131093.36
Organism:
Human herpesvirus 8
Description:
Q9QR71
Residue:
1129
  
Inhibitor
Name:
BDBM74324
Synonyms:
2-(2,2-dimethylcoumaran-7-yl)oxy-N-(3,4,5-trimethoxyphenyl)acetamide 2-[(2,2-dimethyl-3H-1-benzofuran-7-yl)oxy]-N-(3,4,5-trimethoxyphenyl)ethanamide MLS002171729 cid_4827244
Type:
Small organic molecule
Emp. Form.:
C21H25NO6
Mol. Mass.:
387.4263
SMILES:
COc1cc(NC(=O)COc2cccc3CC(C)(C)Oc23)cc(OC)c1OC
: