Target
Tyrosine-protein phosphatase non-receptor type 22
Ligand
BDBM74464
Substrate
Meas. Tech.
Dose Response confirmation of uHTS hits from a small molecule inhibitors of LYP via a fluorescence intensity assay - Set 2
IC50
>79400±0 nM
Citation
 PubChem, PC Dose Response confirmation of uHTS hits from a small molecule inhibitors of LYP via a fluorescence intensity assay - Set 2 PubChem Bioassay (2010)[AID] 
Target
Name:
Tyrosine-protein phosphatase non-receptor type 22
Synonyms:
3.1.3.48 LyP Lymphoid phosphatase (Lyp) PEST-domain phosphatase PTPN22 Tyrosine-protein phosphatase non-receptor type 22 (LYP) | tyrosine-protein phosphatase non-receptor type 22 isoform 1
Type:
Mol. Mass.:
91712.31
Organism:
Homo sapiens (Human)
Description:
Q9Y2R2
Residue:
807
  
Inhibitor
Name:
BDBM74464
Synonyms:
3-(5-chloro-1,3-diketo-3a,4,7,7a-tetrahydroisoindol-2-yl)-N-(2-furfuryl)propionamide 3-(5-chloro-1,3-dioxo-3a,4,7,7a-tetrahydroisoindol-2-yl)-N-(2-furanylmethyl)propanamide 3-[5-chloranyl-1,3-bis(oxidanylidene)-3a,4,7,7a-tetrahydroisoindol-2-yl]-N-(furan-2-ylmethyl)propanamide SMR000070990 | cid_2900724
Type:
Small organic molecule
Emp. Form.:
C16H17ClN2O4
Mol. Mass.:
336.77
SMILES:
ClC1=CCC2C(C1)C(=O)N(CCC(=O)NCc1ccco1)C2=O
: