Target
Tyrosine-protein phosphatase non-receptor type 22
Ligand
BDBM74470
Substrate
Meas. Tech.
Dose Response confirmation of uHTS hits from a small molecule inhibitors of LYP via a fluorescence intensity assay - Set 2
IC50
>79400±0 nM
Citation
 PubChem, PC Dose Response confirmation of uHTS hits from a small molecule inhibitors of LYP via a fluorescence intensity assay - Set 2 PubChem Bioassay (2010)[AID] 
Target
Name:
Tyrosine-protein phosphatase non-receptor type 22
Synonyms:
3.1.3.48 LyP Lymphoid phosphatase (Lyp) PEST-domain phosphatase PTPN22 Tyrosine-protein phosphatase non-receptor type 22 (LYP) | tyrosine-protein phosphatase non-receptor type 22 isoform 1
Type:
Mol. Mass.:
91712.31
Organism:
Homo sapiens (Human)
Description:
Q9Y2R2
Residue:
807
  
Inhibitor
Name:
BDBM74470
Synonyms:
3-(3,4-dimethoxyphenyl)pentane-1,3,5-tricarbonitrile SMR000054572 | cid_223037
Type:
Small organic molecule
Emp. Form.:
C16H17N3O2
Mol. Mass.:
283.3251
SMILES:
COc1ccc(cc1OC)C(CCC#N)(CCC#N)C#N
: