Target
Tyrosine-protein phosphatase non-receptor type 22
Ligand
BDBM74471
Substrate
Meas. Tech.
Dose Response confirmation of uHTS hits from a small molecule inhibitors of LYP via a fluorescence intensity assay - Set 2
IC50
>79400±0 nM
Citation
 PubChem, PC Dose Response confirmation of uHTS hits from a small molecule inhibitors of LYP via a fluorescence intensity assay - Set 2 PubChem Bioassay (2010)[AID] 
Target
Name:
Tyrosine-protein phosphatase non-receptor type 22
Synonyms:
3.1.3.48 LyP Lymphoid phosphatase (Lyp) PEST-domain phosphatase PTPN22 Tyrosine-protein phosphatase non-receptor type 22 (LYP) | tyrosine-protein phosphatase non-receptor type 22 isoform 1
Type:
Mol. Mass.:
91712.31
Organism:
Homo sapiens (Human)
Description:
Q9Y2R2
Residue:
807
  
Inhibitor
Name:
BDBM74471
Synonyms:
4-(Naphthalene-2-sulfonyl)-piperazine-1-sulfonic acid dimethylamide N,N-dimethyl-4-(2-naphthalenylsulfonyl)-1-piperazinesulfonamide N,N-dimethyl-4-naphthalen-2-ylsulfonyl-piperazine-1-sulfonamide SMR000124637 | cid_1094974
Type:
Small organic molecule
Emp. Form.:
C16H21N3O4S2
Mol. Mass.:
383.486
SMILES:
CN(C)S(=O)(=O)N1CCN(CC1)S(=O)(=O)c1ccc2ccccc2c1
: