Target
Tyrosine-protein phosphatase non-receptor type 22
Ligand
BDBM50953
Substrate
Meas. Tech.
Dose Response confirmation of uHTS hits from a small molecule inhibitors of LYP via a fluorescence intensity assay - Set 2
IC50
>79400±0 nM
Citation
 PubChem, PC Dose Response confirmation of uHTS hits from a small molecule inhibitors of LYP via a fluorescence intensity assay - Set 2 PubChem Bioassay (2010)[AID] 
Target
Name:
Tyrosine-protein phosphatase non-receptor type 22
Synonyms:
3.1.3.48 LyP Lymphoid phosphatase (Lyp) PEST-domain phosphatase PTPN22 Tyrosine-protein phosphatase non-receptor type 22 (LYP) | tyrosine-protein phosphatase non-receptor type 22 isoform 1
Type:
Mol. Mass.:
91712.31
Organism:
Homo sapiens (Human)
Description:
Q9Y2R2
Residue:
807
  
Inhibitor
Name:
BDBM50953
Synonyms:
(3Z)-1-(morpholinomethyl)-3-(p-tolylhydrazono)oxindole (3Z)-3-[(4-methylphenyl)hydrazinylidene]-1-(morpholin-4-ylmethyl)indol-2-one MLS000331221 cid_9657242
Type:
Small organic molecule
Emp. Form.:
C20H22N4O2
Mol. Mass.:
350.4143
SMILES:
Cc1ccc(NN=C2C(=O)N(CN3CCOCC3)c3ccccc23)cc1
: