Target
Tyrosine-protein phosphatase non-receptor type 22
Ligand
BDBM42235
Substrate
Meas. Tech.
Dose Response confirmation of uHTS hits from a small molecule inhibitors of LYP via a fluorescence intensity assay - Set 2
IC50
9427±462 nM
Citation
 PubChem, PC Dose Response confirmation of uHTS hits from a small molecule inhibitors of LYP via a fluorescence intensity assay - Set 2 PubChem Bioassay (2010)[AID] 
Target
Name:
Tyrosine-protein phosphatase non-receptor type 22
Synonyms:
3.1.3.48 LyP Lymphoid phosphatase (Lyp) PEST-domain phosphatase PTPN22 Tyrosine-protein phosphatase non-receptor type 22 (LYP) | tyrosine-protein phosphatase non-receptor type 22 isoform 1
Type:
Mol. Mass.:
91712.31
Organism:
Homo sapiens (Human)
Description:
Q9Y2R2
Residue:
807
  
Inhibitor
Name:
BDBM42235
Synonyms:
8-Allyl-2-oxo-2H-chromene-3-carboxylic acid [4-(5-ethyl-[1,3,4]thiadiazol-2-ylsulfamoyl)-phenyl]-amide MLS000588272 N-[4-[(5-ethyl-1,3,4-thiadiazol-2-yl)sulfamoyl]phenyl]-2-oxo-8-prop-2-enyl-1-benzopyran-3-carboxamide SMR000212130 | cid_1714876
Type:
Small organic molecule
Emp. Form.:
C23H20N4O5S2
Mol. Mass.:
496.559
SMILES:
CCc1nnc(NS(=O)(=O)c2ccc(NC(=O)c3cc4cccc(CC=C)c4oc3=O)cc2)s1
: