Target
Tyrosine-protein phosphatase non-receptor type 22
Ligand
BDBM74479
Substrate
Meas. Tech.
Dose Response confirmation of uHTS hits from a small molecule inhibitors of LYP via a fluorescence intensity assay - Set 2
IC50
>79400±0 nM
Citation
 PubChem, PC Dose Response confirmation of uHTS hits from a small molecule inhibitors of LYP via a fluorescence intensity assay - Set 2 PubChem Bioassay (2010)[AID] 
Target
Name:
Tyrosine-protein phosphatase non-receptor type 22
Synonyms:
3.1.3.48 LyP Lymphoid phosphatase (Lyp) PEST-domain phosphatase PTPN22 Tyrosine-protein phosphatase non-receptor type 22 (LYP) | tyrosine-protein phosphatase non-receptor type 22 isoform 1
Type:
Mol. Mass.:
91712.31
Organism:
Homo sapiens (Human)
Description:
Q9Y2R2
Residue:
807
  
Inhibitor
Name:
BDBM74479
Synonyms:
2-(2-Chloro-acetylamino)-2-[4-(1-ethoxycarbonyl-2,2,2-trifluoro-1-hydroxy-ethyl)-phenylamino]-3,3,3-trifluoro-propionic acid ethyl ester 2-[4-[[2-[(2-chloro-1-oxoethyl)amino]-3-ethoxy-1,1,1-trifluoro-3-oxopropan-2-yl]amino]phenyl]-3,3,3-trifluoro-2-hydroxypropanoic acid ethyl ester SMR000212628 ethyl 2-[4-[[2-(2-chloranylethanoylamino)-3-ethoxy-1,1,1-tris(fluoranyl)-3-oxidanylidene-propan-2-yl]amino]phenyl]-3,3,3-tris(fluoranyl)-2-oxidanyl-propanoate | ethyl 2-[4-[[2-[(2-chloroacetyl)amino]-3-ethoxy-1,1,1-trifluoro-3-oxopropan-2-yl]amino]phenyl]-3,3,3-trifluoro-2-hydroxypropanoate
Type:
Small organic molecule
Emp. Form.:
C18H19ClF6N2O6
Mol. Mass.:
508.797
SMILES:
CCOC(=O)C(O)(c1ccc(NC(NC(=O)CCl)(C(=O)OCC)C(F)(F)F)cc1)C(F)(F)F
: