Target
Tyrosine-protein phosphatase non-receptor type 22
Ligand
BDBM74486
Substrate
Meas. Tech.
Dose Response confirmation of uHTS hits from a small molecule inhibitors of LYP via a fluorescence intensity assay - Set 2
IC50
>79400±0 nM
Citation
 PubChem, PC Dose Response confirmation of uHTS hits from a small molecule inhibitors of LYP via a fluorescence intensity assay - Set 2 PubChem Bioassay (2010)[AID] 
Target
Name:
Tyrosine-protein phosphatase non-receptor type 22
Synonyms:
3.1.3.48 LyP Lymphoid phosphatase (Lyp) PEST-domain phosphatase PTPN22 Tyrosine-protein phosphatase non-receptor type 22 (LYP) | tyrosine-protein phosphatase non-receptor type 22 isoform 1
Type:
Mol. Mass.:
91712.31
Organism:
Homo sapiens (Human)
Description:
Q9Y2R2
Residue:
807
  
Inhibitor
Name:
BDBM74486
Synonyms:
2-cyano-N-cyclohexyl-2-cyclohexylidene-acetamide 2-cyano-N-cyclohexyl-2-cyclohexylideneacetamide SMR000227168 | cid_903047
Type:
Small organic molecule
Emp. Form.:
C15H22N2O
Mol. Mass.:
246.348
SMILES:
O=[#6](-[#7]-[#6]-1-[#6]-[#6]-[#6]-[#6]-[#6]-1)-[#6](\C#N)=[#6]-1\[#6]-[#6]-[#6]-[#6]-[#6]-1
: