Target
Tyrosine-protein phosphatase non-receptor type 22
Ligand
BDBM74492
Substrate
Meas. Tech.
Dose Response confirmation of uHTS hits from a small molecule inhibitors of LYP via a fluorescence intensity assay - Set 2
IC50
>79400±0 nM
Citation
 PubChem, PC Dose Response confirmation of uHTS hits from a small molecule inhibitors of LYP via a fluorescence intensity assay - Set 2 PubChem Bioassay (2010)[AID] 
Target
Name:
Tyrosine-protein phosphatase non-receptor type 22
Synonyms:
3.1.3.48 LyP Lymphoid phosphatase (Lyp) PEST-domain phosphatase PTPN22 Tyrosine-protein phosphatase non-receptor type 22 (LYP) | tyrosine-protein phosphatase non-receptor type 22 isoform 1
Type:
Mol. Mass.:
91712.31
Organism:
Homo sapiens (Human)
Description:
Q9Y2R2
Residue:
807
  
Inhibitor
Name:
BDBM74492
Synonyms:
1-cyclohexyl-3-(2,4-dichlorobenzyl)thiourea MLS000390041 cid_2349856
Type:
Small organic molecule
Emp. Form.:
C14H18Cl2N2S
Mol. Mass.:
317.277
SMILES:
Clc1ccc(CNC(=S)NC2CCCCC2)c(Cl)c1
: